{"text_format":"1","workbook":"xlsx","n_sheets":12,"sheets":["CUTTING LIST","Qbiss Screen H+ elements","Longitudinal L-corner elements ","Transversal L-corner elements","U-corner elements","Accessories","Fixing material data","Transport","Data 3 Accessories","UPDATES","Data 1","Data 2"],"not_rendered":{"charts":0,"images":95,"macros":1,"external_links":0,"defined_names":213,"comments":0,"pivot_tables":0},"unopened":[],"bounds":{"document_bytes":16777216,"sheet_cells":100000,"rows_first":2000,"rows_last":500,"rows_between":2000,"halvings":0,"cell_chars":16384,"cell_head_chars":4096},"cells_cut":0,"cells_raw":0,"read":"whole","date_system":"1900"}

{"sheet":"CUTTING LIST","index":0,"n_rows":50,"n_cols":14,"rows_kept":50,"cut":false,"hidden":false,"merged":[[49,0,49,13],[1,2,2,9],[9,0,9,1],[10,0,10,1],[46,4,46,6],[32,4,32,6],[32,9,32,10],[32,0,32,2],[22,0,22,2]]}
[null,null,null,null,null,null,null,null,null,null,null,"Date last saved:",null,{"$f":"ProfessorExcelLastSaveDate()","v":"2020-12-15T08:51:28"}]
[null,null,"INTERACTIVE CUTTING LIST",null,null,null,null,null,null,null,null,"Last saved by:",null,{"$f":"Lastauthor()","v":"Slanšek Matic"}]
[null,null,null,null,null,null,null,null,null,null,null,"Cutting list number:",null,"Insert"]
[null,null,null,null,null,null,null,null,"by Matic Slanšek",null,null,"Revision:",null,"Insert"]
[null,null,null,"Required fields"]
[]
{"$rows_left_out":45}
{"sheet":"Qbiss Screen H+ elements","index":1,"n_rows":78,"n_cols":38,"rows_kept":78,"cut":false,"hidden":false,"merged":[[34,1,34,2],[21,19,22,19],[3,21,4,22],[0,0,0,18],[21,1,22,1],[5,8,5,10],[7,0,7,3],[19,0,19,17],[20,4,20,6],[9,0,9,1],[21,11,21,14],[21,15,22,15],[2,3,2,14],[4,3,4,14],[3,3,3,14],[30,1,33,2],[2,17,2,18],[4,17,4,18],[5,17,5,18],[3,17,3,18],[5,15,5,16],[4,15,4,16],[3,15,3,16],[2,15,2,16],[21,18,22,18],[21,2,22,2],[21,4,21,6],[21,7,21,10],[21,17,22,17],[21,3,22,3]]}
["Qbiss Screen H+ Cutting list for rectangular elements",null,null,null,null,null,null,null,null,null,null,null,null,null,null,null,null,null,null,null,null,null,null,null,null,null,"INSTRUCTIONS"]
[null,null,null,null,null,null,null,null,null,null,null,null,null,null,null,null,null,null,null,null,null,null,null,null,null,null,"Follow steps"]
[null,"Project name:",null,{"$f":"IF('CUTTING LIST'!C10=\"INSERT TEXT\",\"Insert text on first page\",'CUTTING LIST'!C10)","v":"Insert text on first page"},null,null,null,null,null,null,null,null,null,null,null,"Date last saved:",null,{"$f":"'CUTTING LIST'!N1","v":"2020-12-15T08:51:28"},null,null,null,null,null,null,null,null,"1 PHASE / FACADE / BUILDING","Mark positioning of the element according to design shop drawings"]
[null,"Customer name:",null,{"$f":"IF('CUTTING LIST'!C11=\"INSERT TEXT\",\"Insert text on first page\",'CUTTING LIST'!C11)","v":"Insert text on first page"},null,null,null,null,null,null,null,null,null,null,null,"Last saved by:",null,{"$f":"'CUTTING LIST'!N2","v":"Slanšek Matic"},null,null,null,null,null,null,null,null,"2 ELEMENT REF","Mark element according to design shop drawings"]
[null,"Customer order no:",null,{"$f":"IF('CUTTING LIST'!C12=\"INSERT TEXT\",\"Insert text on first page\",'CUTTING LIST'!C12)","v":"Insert text on first page"},null,null,null,null,null,null,null,null,null,null,null,"Cutting list number:",null,{"$f":"IF('CUTTING LIST'!N3=\"Insert\",\"Insert text on first page\",'CUTTING LIST'!N3)","v":"Insert text on first page"},null,null,null,null,null,null,null,null,"3 QTY","Number of elements"]
[null,null,null,null,null,null,null,null,null,null,null,null,null,null,null,"Revision:",null,{"$f":"IF('CUTTING LIST'!N4=\"Insert\",\"Insert text of first page\",'CUTTING LIST'!N4)","v":"Insert text of first page"},null,null,null,null,null,null,null,null,"4 Core type","Honeycomb"]
{"$rows_left_out":73}
{"sheet":"Longitudinal L-corner elements ","index":2,"n_rows":81,"n_cols":42,"rows_kept":81,"cut":false,"hidden":false,"merged":[[3,25,4,26],[21,10,21,13],[21,14,21,17],[21,1,22,1],[20,4,20,9],[5,11,5,13],[7,0,7,3],[19,0,19,21],[21,18,22,18],[21,21,22,21],[21,22,22,22],[4,3,4,18],[4,19,4,20],[21,23,22,23],[30,1,33,2],[4,21,4,22],[5,19,5,20],[5,21,5,22],[0,0,0,22],[2,3,2,18],[3,3,3,18],[2,19,2,20],[2,21,2,22],[3,19,3,20],[3,21,3,22],[21,2,22,2],[21,4,21,9],[8,9,8,10],[21,3,22,3]]}
["Qbiss Screen H+ Cutting list for Longitudinal L-corner elements",null,null,null,null,null,null,null,null,null,null,null,null,null,null,null,null,null,null,null,null,null,null,null,null,null,null,null,null,null,"INSTRUCTIONS"]
[null,null,null,null,null,null,null,null,null,null,null,null,null,null,null,null,null,null,null,null,null,null,null,null,null,null,null,null,null,null,"Follow steps"]
[null,"Project name:",null,{"$f":"IF('CUTTING LIST'!C10=\"INSERT TEXT\",\"Insert text on first page\",'CUTTING LIST'!C10)","v":"Insert text on first page"},null,null,null,null,null,null,null,null,null,null,null,null,null,null,null,"Date last saved:",null,{"$f":"'CUTTING LIST'!N1","v":"2020-12-15T08:51:28"},null,null,null,null,null,null,null,null,"1 PHASE / FACADE / BUILDING","Mark positioning of the element according to design shop drawings"]
[null,"Customer name:",null,{"$f":"IF('CUTTING LIST'!C11=\"INSERT TEXT\",\"Insert text on first page\",'CUTTING LIST'!C11)","v":"Insert text on first page"},null,null,null,null,null,null,null,null,null,null,null,null,null,null,null,"Last saved by:",null,{"$f":"'CUTTING LIST'!N2","v":"Slanšek Matic"},null,null,null,null,null,null,null,null,"2 ELEMENT REF","Mark element according to design shop drawings"]
[null,"Customer order no:",null,{"$f":"IF('CUTTING LIST'!C12=\"INSERT TEXT\",\"Insert text on first page\",'CUTTING LIST'!C12)","v":"Insert text on first page"},null,null,null,null,null,null,null,null,null,null,null,null,null,null,null,"Cutting list number:",null,{"$f":"IF('CUTTING LIST'!N3=\"Insert\",\"Insert text on first page\",'CUTTING LIST'!N3)","v":"Insert text on first page"},null,null,null,null,null,null,null,null,"3 QTY","Number of elements"]
[null,null,null,null,null,null,null,null,null,null,null,null,null,null,null,null,null,null,null,"Revision:",null,{"$f":"IF('CUTTING LIST'!N4=\"Insert\",\"Insert text on first page\",'CUTTING LIST'!N4)","v":"Insert text on first page"},null,null,null,null,null,null,null,null,"4 Core type","Honeycomb"]
{"$rows_left_out":76}
{"sheet":"Transversal L-corner elements","index":3,"n_rows":81,"n_cols":42,"rows_kept":81,"cut":false,"hidden":false,"merged":[[34,1,34,2],[21,23,22,23],[30,1,33,2],[21,2,22,2],[21,4,21,9],[21,10,21,13],[21,14,21,17],[21,1,22,1],[21,3,22,3],[23,37,23,39],[8,9,8,10],[21,18,22,18],[21,21,22,21],[21,22,22,22],[22,37,22,39],[7,0,7,3],[9,4,18,5],[19,0,19,21],[20,4,20,9],[5,19,5,20],[5,21,5,22],[0,0,0,22],[2,19,2,20],[5,11,5,13],[4,3,4,18],[3,3,3,18],[2,3,2,18],[2,21,2,22],[3,19,3,20],[3,21,3,22],[4,19,4,20],[4,21,4,22]]}
["Qbiss Screen H+ Cutting list for Transversal L-corner elements",null,null,null,null,null,null,null,null,null,null,null,null,null,null,null,null,null,null,null,null,null,null,null,null,null,null,null,null,null,"INSTRUCTIONS"]
[null,null,null,null,null,null,null,null,null,null,null,null,null,null,null,null,null,null,null,null,null,null,null,null,null,null,null,null,null,null,"Follow steps"]
[null,"Project name:",null,{"$f":"IF('CUTTING LIST'!C10=\"INSERT TEXT\",\"Insert text on first page\",'CUTTING LIST'!C10)","v":"Insert text on first page"},null,null,null,null,null,null,null,null,null,null,null,null,null,null,null,"Date last saved:",null,{"$f":"'CUTTING LIST'!N1","v":"2020-12-15T08:51:28"},null,null,null,null,null,null,null,null,"1 PHASE / FACADE / BUILDING","Mark positioning of the element according to design shop drawings"]
[null,"Customer name:",null,{"$f":"IF('CUTTING LIST'!C11=\"INSERT TEXT\",\"Insert text on first page\",'CUTTING LIST'!C11)","v":"Insert text on first page"},null,null,null,null,null,null,null,null,null,null,null,null,null,null,null,"Last saved by:",null,{"$f":"'CUTTING LIST'!N2","v":"Slanšek Matic"},null,null,null,null,null,null,null,null,"2 ELEMENT REF","Mark element according to design shop drawings"]
[null,"Customer order no:",null,{"$f":"IF('CUTTING LIST'!C12=\"INSERT TEXT\",\"Insert text on first page\",'CUTTING LIST'!C12)","v":"Insert text on first page"},null,null,null,null,null,null,null,null,null,null,null,null,null,null,null,"Cutting list number:",null,{"$f":"IF('CUTTING LIST'!N3=\"Insert\",\"Insert text on first page\",'CUTTING LIST'!N3)","v":"Insert text on first page"},null,null,null,null,null,null,null,null,"3 QTY","Number of elements"]
[null,null,null,null,null,null,null,null,null,null,null,null,null,null,null,null,null,null,null,"Revision:",null,{"$f":"IF('CUTTING LIST'!N4=\"Insert\",\"Insert text on first page\",'CUTTING LIST'!N4)","v":"Insert text on first page"},null,null,null,null,null,null,null,null,"4 Core type","Honeycomb"]
{"$rows_left_out":76}
{"sheet":"U-corner elements","index":4,"n_rows":82,"n_cols":43,"rows_kept":82,"cut":false,"hidden":false,"merged":[[21,24,22,24],[0,0,0,23],[21,16,21,19],[21,20,22,20],[21,1,22,1],[20,4,20,11],[5,13,5,15],[7,0,7,3],[19,0,19,22],[21,22,22,22],[21,4,21,11],[21,2,22,2],[21,23,22,23],[21,12,21,15],[2,3,2,19],[2,20,2,21],[2,22,2,23],[3,20,3,21],[3,22,3,23],[30,1,33,2],[5,20,5,21],[5,22,5,23],[4,3,4,19],[3,3,3,19],[4,20,4,21],[4,22,4,23],[9,0,9,1],[21,3,22,3]]}
["Qbiss Screen H+ Cutting list for U-corner elements",null,null,null,null,null,null,null,null,null,null,null,null,null,null,null,null,null,null,null,null,null,null,null,null,null,null,null,null,null,null,"INSTRUCTIONS"]
[null,null,null,null,null,null,null,null,null,null,null,null,null,null,null,null,null,null,null,null,null,null,null,null,null,null,null,null,null,null,null,"Follow steps"]
[null,"Project name:",null,{"$f":"IF('CUTTING LIST'!C10=\"INSERT TEXT\",\"Insert text on first page\",'CUTTING LIST'!C10)","v":"Insert text on first page"},null,null,null,null,null,null,null,null,null,null,null,null,null,null,null,null,"Date last saved:",null,{"$f":"'CUTTING LIST'!N1","v":"2020-12-15T08:51:28"},null,null,null,null,null,null,null,null,"1 PHASE / FACADE / BUILDING","Mark positioning of the element according to design shop drawings"]
[null,"Customer name:",null,{"$f":"IF('CUTTING LIST'!C11=\"INSERT TEXT\",\"Insert text on first page\",'CUTTING LIST'!C11)","v":"Insert text on first page"},null,null,null,null,null,null,null,null,null,null,null,null,null,null,null,null,"Last saved by:",null,{"$f":"'CUTTING LIST'!N2","v":"Slanšek Matic"},null,null,null,null,null,null,null,null,"2 ELEMENT REF","Mark element according to design shop drawings"]
[null,"Customer order no:",null,{"$f":"IF('CUTTING LIST'!C12=\"INSERT TEXT\",\"Insert text on first page\",'CUTTING LIST'!C12)","v":"Insert text on first page"},null,null,null,null,null,null,null,null,null,null,null,null,null,null,null,null,"Cutting list number:",null,{"$f":"IF('CUTTING LIST'!N3=\"Insert\",\"Insert text on first page\",'CUTTING LIST'!N3)","v":"Insert text on first page"},null,null,null,null,null,null,null,null,"3 QTY","Number of elements"]
[null,null,null,null,null,null,null,null,null,null,null,null,null,null,null,null,null,null,null,null,"Revision:",null,{"$f":"IF('CUTTING LIST'!N4=\"Insert\",\"Insert text on first page\",'CUTTING LIST'!N4)","v":"Insert text on first page"},null,null,null,null,null,null,null,null,"4 Core type","Honeycomb"]
{"$rows_left_out":77}
{"sheet":"Accessories","index":5,"n_rows":34,"n_cols":25,"rows_kept":34,"cut":false,"hidden":false,"merged":[[7,0,7,2],[24,0,24,1],[25,0,25,1],[26,0,26,1],[9,3,11,3],[9,2,11,2],[9,0,11,1],[9,9,9,14],[9,7,11,8],[9,5,11,6],[9,4,11,4],[47,0,47,1],[41,0,41,1],[42,0,42,1],[43,0,43,1],[44,0,44,1],[45,0,45,1],[46,0,46,1],[12,4,17,4],[12,5,17,5],[18,0,23,1],[18,2,23,2],[18,3,23,3],[18,4,23,4],[18,5,23,5],[12,0,17,1],[12,2,17,2],[12,3,17,3],[0,0,0,18],[5,15,5,16],[5,17,5,18],[5,10,5,12],[2,15,2,16],[2,17,2,18],[3,15,3,16],[3,17,3,18],[4,15,4,16],[4,17,4,18],[12,7,17,7],[12,8,17,8],[29,20,29,24],[18,6,23,6],[18,7,23,7],[18,8,23,8],[18,9,19,14],[22,9,22,10],[23,9,23,10],[20,13,21,13],[28,24,28,26],[27,20,27,22],[27,24,27,26],[28,20,28,22],[20,9,21,10],[12,6,17,6],[27,3,28,3],[27,8,28,8],[27,7,28,7],[27,6,28,6],[27,5,28,5],[27,4,28,4],[40,0,40,1],[34,0,34,1],[35,0,35,1],[27,0,28,1],[27,2,28,2],[36,0,36,1],[38,0,38,1],[29,0,29,1],[20,12,21,12],[20,11,21,11],[20,14,21,14],[30,0,30,1],[42,20,42,24],[39,20,39,24],[33,20,33,22],[33,24,33,26],[39,0,39,1],[31,0,31,1],[32,0,32,1],[37,0,37,1],[30,13,30,16],[32,13,32,16],[31,17,32,17],[31,18,32,18],[2,20,2,28],[3,20,3,28],[5,20,5,27],[6,20,6,26],[7,20,7,26]]}
["Qbiss Screen H+ Accessories",null,null,null,null,null,null,null,null,null,null,null,null,null,null,null,null,null,null,null,"INSTRUCTIONS"]
[]
[null,"Project name:",null,{"$f":"IF('CUTTING LIST'!C10=\"INSERT TEXT\",\"Insert text on first page\",'CUTTING LIST'!C10)","v":"Insert text on first page"},null,null,null,null,null,null,null,null,null,null,null,"Date last saved:",null,{"$f":"ProfessorExcelLastSaveDate()","v":"2020-12-15T08:51:28"},null,null,"Fulfill ORDER QUANTITY"]
[null,"Customer name:",null,{"$f":"IF('CUTTING LIST'!C11=\"INSERT TEXT\",\"Insert text on first page\",'CUTTING LIST'!C11)","v":"Insert text on first page"},null,null,null,null,null,null,null,null,null,null,null,"Laste saved by:",null,{"$f":"ProfessorExcelLastSavedBy()","v":"Slanšek Matic"},null,null,"1 Material of substructure: Select the material"]
[null,"Customer order no:",null,{"$f":"IF('CUTTING LIST'!C12=\"INSERT TEXT\",\"Insert text on first page\",'CUTTING LIST'!C18)","v":"Insert text on first page"},null,null,null,null,null,null,null,null,null,null,null,"Cutting list number:",null,{"$f":"IF('CUTTING LIST'!N3=\"Insert\",\"Insert text on first page\",'CUTTING LIST'!N3)","v":"Insert text on first page"},null,null,"2 Minimal thickness of substructure: Select the minimum thickness. Accordingly, fixation screw will be determined"]
[null,null,{"$f":"'Qbiss Screen H+ elements'!M10","v":{"$error":"#N/A"}},null,null,null,null,null,null,null,null,null,null,null,null,"Revision:",null,{"$f":"IF('CUTTING LIST'!N4=\"Insert\",\"Insert text on first page\",'CUTTING LIST'!N4)","v":"Insert text on first page"},null,null,"3 Name of fixing screw will be automatically determined based on previous selection"]
{"$rows_left_out":29}
{"sheet":"Fixing material data","index":6,"n_rows":23,"n_cols":13,"rows_kept":23,"cut":false,"hidden":true,"merged":[[0,3,0,8],[2,3,2,4],[18,1,18,3],[17,0,17,4]]}
[null,null,null,"FIXING MATERIAL"]
[]
["Material of substructure","Minimal thickness of substructure (mm)","Material and thickness","Name of fixing screw",null,"Code of fixing screw"]
["Aluminium",3,{"$f":"A4&B4","v":"Aluminium3"},"Ejot JT4 6-5.5-30 A2",null,30028922,null,null,null,"Aluminium","Steel","INOX"]
["Aluminium",2,{"$f":"A5&B5","v":"Aluminium2"},"Ejot JT9 6-5.5-30 A4",null,30030791,null,null,null,2,2,2]
["Steel",2,"Steel2","Ejot JT3 6-5.5-35 A2",null,30023320,null,null,null,3]
{"$rows_left_out":18}
{"sheet":"Transport","index":7,"n_rows":59,"n_cols":29,"rows_kept":59,"cut":false,"hidden":false,"merged":[[55,1,57,2],[5,16,5,17],[7,0,7,2],[9,6,9,7],[5,7,5,9],[4,14,4,15],[4,16,4,17],[5,14,5,15],[0,0,0,17],[2,14,2,15],[2,16,2,17],[3,14,3,15],[3,16,3,17]]}
["Qbiss Screen H+ Transport",null,null,null,null,null,null,null,null,null,null,null,null,null,null,null,null,null,null,"INSTRUCTIONS"]
[null,null,null,null,null,null,null,null,null,null,null,null,null,null,null,null,null,null,null,"Follow steps"]
[null,"Project name:",null,{"$f":"IF('CUTTING LIST'!C10=\"\",\"Insert text on first page\",'CUTTING LIST'!C10)","v":"Insert text"},null,null,null,null,null,null,null,null,null,null,"Date last saved:",null,{"$f":"ProfessorExcelLastSaveDate()","v":"2020-12-15T08:51:28"},null,null,"STEP 1: Select type of transport","You can select among Truck, Train, Ship transport. ",null,null,null,null,"MORE"]
[null,"Customer name:",null,{"$f":"IF('CUTTING LIST'!C11=\"\",\"Insert text on first page\",'CUTTING LIST'!C11)","v":"Insert text"},null,null,null,null,null,null,null,null,null,null,"Laste saved by:",null,{"$f":"ProfessorExcelLastSavedBy()","v":"Slanšek Matic"},null,null,"STEP 2: Select type of packaging","Select among standard and extended packaging. See the difference on the following",null,null,null,null,null,null,null,"LINK"]
[null,"Customer order no:",null,{"$f":"IF('CUTTING LIST'!C12=\"\",\"Insert text on first page\",'CUTTING LIST'!C12)","v":"Insert text"},null,null,null,null,null,null,null,null,null,null,"Cutting list number:",null,{"$f":"IF('CUTTING LIST'!N3=\"\",\"insert text of first page\",'CUTTING LIST'!N3)","v":"Insert"},null,null,"STEP 3: Select additional options"]
[null,null,null,null,null,null,null,null,null,null,null,null,null,null,"Revision:",null,{"$f":"IF('CUTTING LIST'!N4=\"\",\"insert text of first page\",'CUTTING LIST'!N4)","v":"Insert"},null,null,null,"EPS support blocks"]
{"$rows_left_out":54}
{"sheet":"Data 3 Accessories","index":8,"n_rows":108,"n_cols":39,"rows_kept":108,"cut":false,"hidden":true,"merged":[]}
[null,null,null,"B_B_Horizontal",null,"B_BF_Horizontal",null,"BF_B_Horizontal",null,"BF_BF_Horizontal",null,"F_B_Horizontal",null,"F_BF_Horizontal",null,"B_B_Horizontal_brick",null,"B_BF_Horizontal_brick",null,"BF_B_Horizontal_brick",null,"BF_BF_Horizontal_brick",null,"F_B_Horizontal_brick",null,"F_BF_Horizontal_brick",null,"B_B_Horizontal_asymmetrical_brick",null,"B_BF_Horizontal_asymmetrical_brick",null,"BF_B_Horizontal_asymmetrical_brick",null,"BF_BF_Horizontal_asymmetrical_brick",null,"F_B_Horizontal_asymmetrical_brick",null,"F_BF_Horizontal_asymmetrical_brick"]
[null,null,null,"Qbiss Screen H+ - B-B - Horizontal assembly","Note","Qbiss Screen H+ - B-BF - Horizontal assembly","Note","Qbiss Screen H+ - BF-B - Horizontal assembly","Note","Qbiss Screen H+ - BF-BF - Horizontal assembly","Note","Qbiss Screen H+ - F-B - Horizontal assembly","Note","Qbiss Screen H+ - F-BF - Horizontal assembly","Note","Qbiss Screen H+ - B-B - Brick assembly","Note","Qbiss Screen H+ - B-BF - Horizontal brick assembly","Note","Qbiss Screen H+ - BF-B - Horizontal brick assemly","Note","Qbiss Screen H+ - BF-BF - Horizontal brick assembly","Note","Qbiss Screen H+ - F-B - Horizontal brick assembly","Note","Qbiss Screen H+ - F-BF - Horizontal brick assembly","Note","Qbiss Screen H+ - B-B Horizontal asymmertical brick assembly","Note","Qbiss Screen H+ - B-BF - Horizontal brick assembly","Note","Qbiss Screen H+ - BF-B - Horizontal asymmetrical brick assembly","Note","Qbiss Screen H+ - BF-BF - Horizontal asymmetrical brick assembly","Note","Qbiss Screen H+ - F-B - Horizontal asymmetrical brick assembly","Note","Qbiss Screen H+ - F-BF - Horizontal asymmetrical brick assembly","Note"]
[]
[]
[]
["Primer šifre SAP",null,null,"QSH+-1000 SEREN WHITE PVDF40 70/0000 SP70",null,"Q100-1200 9006 PVDF 070/9006 SP 055-KT\nPROFIL HF52 RAL9006 PVDF 34.1x21 AL\nProfil HF 14 v sklopu panela na linij!",null,"Q100-1200 9006 PVDF 070/9006 SP 055-KT\nPROFIL HF40 RAL 9006 PVDF 13.1x20 AL\nProfil HF 55 v sklopu panela na linij!",null,"Q100-1200 9006 PVDF 070/9006 SP 055-KT\nPROFIL HF52 RAL9006 PVDF 34.1x21 AL\nProfil HF 55 v sklopu panela na linij!",null,"QFB100-1060 9006 PVDF 70/9002 SP50-KT\nPROFIL HF40 RAL 9006 PVDF 13.1x20 AL\nNi profila v sklopu panela na linij!",null,"QFB100-1060 9006 PVDF 70/9002 SP50-KT\nPROFIL HF52 RAL9006 PVDF 34.1x21 AL\nNi profila v sklopu panela na linij!",null,"Q100-1200 9006 PVDF 070/9006 SP 055-KT\nPROFIL HF40 RAL 9006 PVDF 13.1x20 AL\nProfil HF 14 v sklopu panela na linij!",null,"Q100-1200 9006 PVDF 070/9006 SP 055-KT\nPROFIL HF52 RAL9006 PVDF 34.1x21 AL\nProfil HF 14 v sklopu panela na linij!",null,"Q100-1200 9006 PVDF 070/9006 SP 055-KT\nPROFIL HF40 RAL 9006 PVDF 13.1x20 AL\nProfil HF 55 v sklopu panela na linij!",null,"Q100-1200 9006 PVDF 070/9006 SP 055-KT\nPROFIL HF52 RAL9006 PVDF 34.1x21 AL\nProfil HF 55 v sklopu panela na linij!",null,"QFB100-1060 9006 PVDF 70/9002 SP50-KT\nPROFIL HF40 RAL 9006 PVDF 13.1x20 AL\nNi profila v sklopu panela na linij!",null,"QFB100-1060 9006 PVDF 70/9002 SP50-KT\nPROFIL HF52 RAL9006 PVDF 34.1x21 AL\nNi profila v sklopu panela na linij!",null,"Q100-1200 9006 PVDF 070/9006 SP 055-KT\nPROFIL HF40 RAL 9006 PVDF 13.1x20 AL\nProfil HF 14 v sklopu panela na linij!",null,"Q100-1200 9006 PVDF 070/9006 SP 055-KT\nPROFIL HF52 RAL9006 PVDF 34.1x21 AL\nProfil HF 14 v sklopu panela na linij!",null,"Q100-1200 9006 PVDF 070/9006 SP 055-KT\nPROFIL HF40 RAL 9006 PVDF 13.1x20 AL\nProfil HF 55 v sklopu panela na linij!",null,"Q100-1200 9006 PVDF 070/9006 SP 055-KT\nPROFIL HF52 RAL9006 PVDF 34.1x21 AL\nProfil HF 55 v sklopu panela na linij!",null,"QFB100-1060 9006 PVDF 70/9002 SP50-KT\nPROFIL HF40 RAL 9006 PVDF 13.1x20 AL\nNi profila v sklopu panela na linij!",null,"QFB100-1060 9006 PVDF 70/9002 SP50-KT\nPROFIL HF52 RAL9006 PVDF 34.1x21 AL\nNi profila v sklopu panela na linij!"]
{"$rows_left_out":103}
{"sheet":"UPDATES","index":9,"n_rows":2,"n_cols":2,"rows_kept":2,"cut":false,"hidden":true,"merged":[]}
["Version","What is new"]
["1.0","Release"]

{"sheet":"Data 1","index":10,"n_rows":148,"n_cols":17,"rows_kept":148,"cut":false,"hidden":true,"merged":[[146,1,146,5],[147,1,147,5]]}
["Data"]
["Type of cladding  system","System"]
["Horizontal"]
["Vertical_internal_wall"]
["Horizontal_brick"]
["Horizontal_asymmertical_brick"]
{"$rows_left_out":143}
{"sheet":"Data 2","index":11,"n_rows":99,"n_cols":14,"rows_kept":99,"cut":false,"hidden":true,"merged":[]}
["External colour","External coating",null,null,"Internal colour","Internal coating",null,null,"Thickness of external steel sheet",null,null,null,null,"External steel sheet profilation"]
[null,null,null,null,null,null,null,null,0.7,null,null,null,null,"G"]
["White","PUR-PA 50",null,null,"RAL 9010","SP 25"]
["Grey White","PUR-PA 50",null,null,"RAL 9002","PVDF 25"]
["Cream","PUR-PA 50",null,null,"RAL 1015","PVDF 35",null,null,"Thickness of internal steel sheet"]
["Light Grey","PUR-PA 50",null,null,"RAL7035","PUR/PA 50"]
{"$rows_left_out":93}